sampl,strata,psu,region,smsa,location,houssiz,sex,race,age,height,weight,bpsystol,bpdiast,tcresult,tgresult,hdresult,hgb,hct,tibc,iron,hlthstat,heartatk,diabetes,sizplace,finalwgt,leadwt,corpuscl,trnsfern,albumin,vitaminc,zinc,copper,porphyrn,lead,female,black,orace,fhtatk,hsizgp,hsiz1,hsiz2,hsiz3,hsiz4,hsiz5,region1,region2,region3,region4,smsa1,smsa2,smsa3,rural,loglead,agegrp,highlead,bmi,highbp
1400,1,1,S,2,1,4,Male,White,54,174.59801,62.48,106,80,226,,,13.9,42.700001,377,86,2,0,0,2,8995,0,89,22.799999,4.6999998,.40000001,104,156,38,,0,0,0,,4,0,0,0,1,0,0,0,1,0,0,1,0,0,,50-59,,20.495686,0
1401,1,1,S,2,1,6,Female,White,41,152.297,48.759998,108,66,179,,,10.9,33,363,24,2,0,0,2,25964,53543,92.400002,6.5999999,4.5999999,1.2,111,139,92,13,1,0,0,0,5,0,0,0,0,1,0,0,1,0,0,1,0,0,2.5649493,40-49,lead<25,21.022337,0
1402,1,1,S,1,1,6,Female,Other,21,164.09801,67.25,98,66,137,,,13.5,40.5,353,129,3,0,0,2,8752,0,106.3,36.5,4.5999999,1.3,102,238,48,,1,0,1,0,5,0,0,0,0,1,0,0,1,0,1,0,0,0,,20-29,,24.97386,0
1404,1,1,S,2,1,9,Female,White,63,162.59801,94.459999,180,80,189,,,13.4,38.700001,365,36,4,0,1,2,4310,0,83.400002,9.8999996,4.5999999,1.1,109,132,62,,1,0,0,0,5,0,0,0,0,1,0,0,1,0,0,1,0,0,,60-69,,35.728722,1
1405,1,1,S,1,1,3,Female,White,64,163.09801,74.279999,120,76,311,,,15.6,45.5,320,91,2,0,0,2,9011,19286,95,28.4,4.5999999,1.3,99,127,44,20,1,0,0,0,3,0,0,1,0,0,0,0,1,0,1,0,0,0,2.9957323,60-69,lead<25,27.923803,0
1406,1,1,S,1,1,1,Female,White,63,147.09801,66,180,90,187,,,15.7,47.200001,330,64,5,0,0,2,4310,0,104,19.4,4.0999999,1.4,101,164,41,,1,0,0,0,1,1,0,0,0,0,0,0,1,0,1,0,0,0,,60-69,,30.502144,1
1407,1,1,S,1,1,2,Female,White,67,153.89799,54.549999,100,74,187,,,13.3,41,312,90,2,0,0,2,3201,6457,102,28.799999,4.4000001,1.2,93,159,43,13,1,0,0,0,2,0,1,0,0,0,0,0,1,0,1,0,0,0,2.5649493,60-69,lead<25,23.031851,0
1408,1,1,S,2,1,1,Female,White,57,160,58.970001,154,90,206,,,15.7,45.5,451,61,1,0,0,2,25386,0,105.3,13.5,4.9000001,1.4,83,130,49,,1,0,0,0,1,1,0,0,0,0,0,0,1,0,0,1,0,0,,50-59,,23.035156,1
1410,1,1,S,2,1,3,Female,White,68,164,68.949997,120,76,244,,,14.5,41.5,375,74,2,0,0,2,12102,0,94.699997,19.700001,4.8000002,1.3,98,145,52,,1,0,0,0,3,0,0,1,0,0,0,0,1,0,0,1,0,0,,60-69,,25.63578,0
1411,1,1,S,2,1,4,Male,Black,68,176.59801,65.43,104,66,255,,,13.1,40.700001,204,48,5,0,0,2,4312,10031,96.199997,23.5,4.0999999,.2,98,175,45,17,0,1,0,,4,0,0,0,1,0,0,0,1,0,0,1,0,0,2.8332133,60-69,lead<25,20.979992,0
1412,1,1,S,2,1,1,Female,White,70,156.19901,76.769997,186,96,197,,,13.9,42.700001,353,83,2,0,0,2,4031,0,92,23.5,4.3000002,1.4,92,115,53,,1,0,0,0,1,1,0,0,0,0,0,0,1,0,0,1,0,0,,70+,,31.465527,1
1413,1,1,S,2,1,3,Female,Black,60,170.09801,58.400002,90,70,209,,,14.7,42.5,412,95,2,0,0,2,3628,8642,,23.1,4.5,.2,90,154,32,20,1,1,0,0,3,0,0,1,0,0,0,0,1,0,0,1,0,0,2.9957323,60-69,lead<25,20.184334,0
1414,1,1,S,2,1,4,Female,White,36,151.797,65.769997,104,60,170,,,14.7,41.700001,412,54,3,0,0,2,28590,0,88.699997,13.1,5.0999999,.40000001,101,167,60,,1,0,0,0,4,0,0,0,1,0,0,0,1,0,0,1,0,0,,30-39,,28.543121,0
1415,1,1,S,2,1,2,Female,White,24,154.19901,48.540001,100,66,244,,,12.5,38.700001,436,138,4,0,0,2,22754,48227,93.699997,31.700001,4.4000001,1.5,,,,13,1,0,0,0,2,0,1,0,0,0,0,0,1,0,0,1,0,0,2.5649493,20-29,lead<25,20.4144,0
1417,1,1,S,2,1,4,Male,Black,32,171.09801,73.029999,110,82,204,,,15.6,47.700001,308,150,1,0,0,2,7119,14186,91.900002,48.700001,5.0999999,.30000001,123,158,40,29,0,1,0,,4,0,0,0,1,0,0,0,1,0,0,1,0,0,3.3672957,30-39,lead>=25,24.946602,0
1418,1,1,S,1,1,1,Male,Black,68,169.297,68.720001,140,70,196,,,7.8000002,23,314,91,5,0,1,2,3781,0,97,29,4.0999999,.60000002,73,132,89,,0,1,0,,1,1,0,0,0,0,0,0,1,0,1,0,0,0,,60-69,,23.976437,1
1419,1,1,S,1,1,7,Female,White,66,151.39799,88.110001,156,100,229,,,14,43.700001,370,77,5,0,1,2,9611,19388,,20.799999,3.9000001,.30000001,80,132,35,22,1,0,0,0,5,0,0,0,0,1,0,0,1,0,1,0,0,0,3.0910425,60-69,lead<25,38.44014,1
1420,1,1,S,2,1,1,Female,White,73,162,68.040001,154,60,227,,,14,43,361,74,1,0,0,2,13802,0,98.900002,20.5,4.3000002,1.4,99,258,51,,1,0,0,0,1,1,0,0,0,0,0,0,1,0,0,1,0,0,,70+,,25.925926,1
1421,1,1,S,2,1,1,Female,White,73,171.797,61.580002,130,66,254,,,13.5,40.200001,359,101,4,0,0,2,4031,8609,100,28.1,4.6999998,1.5,121,147,49,10,1,0,0,0,1,1,0,0,0,0,0,0,1,0,0,1,0,0,2.3025851,70+,lead<25,20.864529,0
1423,1,1,S,1,1,2,Male,White,66,170.09801,52.5,136,84,213,,,13.1,40.700001,400,114,3,0,0,2,3588,8126,89.599998,28.5,4.9000001,.40000001,107,166,34,15,0,0,0,,2,0,1,0,0,0,0,0,1,0,1,0,0,0,2.7080503,60-69,lead<25,18.145163,0
1424,1,1,S,2,1,2,Female,White,57,153.297,68.379997,160,100,253,,,13.9,40.5,393,87,2,0,0,2,8623,0,89.800003,22.1,4.3000002,1.4,98,128,51,,1,0,0,0,2,0,1,0,0,0,0,0,1,0,0,1,0,0,,50-59,,29.09791,1
1427,1,1,S,1,1,3,Male,Black,52,179.39799,124.51,108,80,174,,,14,44,353,77,5,0,1,2,13797,27988,102.1,21.799999,4.5999999,1.2,89,121,44,31,0,1,0,,3,0,0,1,0,0,0,0,1,0,1,0,0,0,3.4339871,50-59,lead>=25,38.687359,0
1428,1,1,S,1,1,2,Male,White,37,173.797,66.230003,122,78,231,,,16.1,46.700001,393,59,1,0,0,2,8817,0,,15,5.5999999,,90,162,49,,0,0,0,,2,0,1,0,0,0,0,0,1,0,1,0,0,0,,30-39,,21.926546,0
1429,1,1,S,2,1,2,Female,White,59,155.19901,82.440002,126,76,205,,,13,39.200001,380,112,3,0,0,2,25386,54087,92.5,29.5,4.6999998,1.5,95,111,52,,1,0,0,0,2,0,1,0,0,0,0,0,1,0,0,1,0,0,,50-59,,34.226315,0
1430,1,1,S,2,1,2,Male,White,60,178.39799,85.620003,126,80,159,,,15.9,47,332,91,4,0,0,2,9058,0,100.2,27.4,3.9000001,.5,113,134,33,,0,0,0,,2,0,1,0,0,0,0,0,1,0,0,1,0,0,,60-69,,26.902664,0
1431,1,1,S,2,1,4,Male,White,34,173,69.059998,118,82,243,,,15.4,44,368,182,1,0,0,2,9153,19295,84.900002,49.5,5.4000001,1.6,84,97,38,13,0,0,0,,4,0,0,0,1,0,0,0,1,0,0,1,0,0,2.5649493,30-39,lead<25,23.07461,0
1432,1,1,S,2,1,1,Female,White,64,140.39799,47.970001,120,82,249,,,13.3,41,295,77,3,0,0,2,3035,0,90.099998,26.1,4.5,2,87,126,33,,1,0,0,0,1,1,0,0,0,0,0,0,1,0,0,1,0,0,,60-69,,24.335928,0
1433,1,1,S,2,1,2,Female,White,57,163,74.160004,120,68,201,,,13.7,43,375,60,3,0,0,2,8868,19287,,16,4.4000001,1.4,,,43,20,1,0,0,0,2,0,1,0,0,0,0,0,1,0,0,1,0,0,2.9957323,50-59,lead<25,27.91223,0
1434,1,1,S,2,1,3,Female,Black,29,159.297,66.790001,96,76,178,,,13.1,41.700001,414,52,3,0,0,2,27018,0,102,12.6,4.8000002,,,,37,,1,1,0,0,3,0,0,1,0,0,0,0,1,0,0,1,0,0,,20-29,,26.320629,0
1435,1,1,S,2,1,2,Male,White,68,152.797,76.089996,154,94,223,,,14.8,43,320,128,3,0,0,2,2881,6164,94.300003,40,4.3000002,.80000001,103,113,41,16,0,0,0,,2,0,1,0,0,0,0,0,1,0,0,1,0,0,2.7725887,60-69,lead<25,32.591019,1
1437,1,1,S,2,1,2,Male,White,64,178.797,82.330002,144,84,255,,,16.1,46.700001,408,124,4,0,0,2,10292,18041,87.099998,30.4,4.5,2.2,111,114,35,16,0,0,0,,2,0,1,0,0,0,0,0,1,0,0,1,0,0,2.7725887,60-69,lead<25,25.753584,1
1438,1,1,S,2,1,7,Female,Black,34,164.89799,81.870003,114,86,226,,,12.3,38.700001,404,115,1,0,0,2,10392,0,81.5,28.5,4.9000001,1.3,123,104,40,,1,1,0,0,5,0,0,0,0,1,0,0,1,0,0,1,0,0,,30-39,,30.108843,0
1439,1,1,S,2,1,1,Female,White,22,165.297,57.610001,90,68,182,,,13.7,41.5,355,88,1,0,0,2,23205,51533,94.5,24.799999,4.5,2,83,126,49,11,1,0,0,0,1,1,0,0,0,0,0,0,1,0,0,1,0,0,2.3978953,20-29,lead<25,21.084726,0
1441,1,1,S,1,1,3,Male,White,62,154.69901,66.230003,160,100,232,,,15.9,47,358,63,3,0,0,2,3799,8151,94.800003,17.6,4.8000002,1.1,79,88,42,18,0,0,0,,3,0,0,1,0,0,0,0,1,0,1,0,0,0,2.8903718,60-69,lead<25,27.674498,1
1442,1,1,S,1,1,1,Male,White,53,161.5,58.509998,110,70,192,,,16.200001,48.700001,459,150,4,0,0,2,8747,0,99.400002,32.700001,4.9000001,.80000001,105,181,37,,0,0,0,,1,1,0,0,0,0,0,0,1,0,1,0,0,0,,50-59,,22.43288,0
1445,1,1,S,2,1,2,Female,White,74,144.39799,55.34,160,80,294,,,13.9,40.5,326,59,3,0,0,2,4597,11232,88.800003,18.1,4.6999998,1.3,115,131,57,12,1,0,0,0,2,0,1,0,0,0,0,0,1,0,0,1,0,0,2.4849067,70+,lead<25,26.540972,1
1446,1,1,S,2,1,4,Female,White,27,171.5,58.849998,84,60,164,,,13.3,41.5,356,95,2,0,0,2,28255,0,,26.700001,5.0999999,1.6,80,99,57,,1,0,0,0,4,0,0,0,1,0,0,0,1,0,0,1,0,0,,20-29,,20.008669,0
1448,1,1,S,2,1,6,Female,Black,29,162.797,67.589996,104,78,232,,,12.9,40.5,469,73,2,0,0,2,10392,0,,15.6,5.3000002,,112,103,40,,1,1,0,0,5,0,0,0,0,1,0,0,1,0,0,1,0,0,,20-29,,25.502905,0
1449,1,1,S,2,1,2,Female,White,67,154.19901,64.07,150,94,230,,,13.6,39.5,402,68,3,0,0,2,13802,33722,92.900002,16.9,4.5999999,1.5,107,148,51,16,1,0,0,0,2,0,1,0,0,0,0,0,1,0,0,1,0,0,2.7725887,60-69,lead<25,26.945831,1
1450,1,1,S,2,1,2,Male,White,64,160.59801,62.939999,132,84,213,,,12.4,39.5,375,36,4,0,0,2,11405,0,90.400002,9.6000004,4.1999998,.89999998,104,101,71,,0,0,0,,2,0,1,0,0,0,0,0,1,0,0,1,0,0,,60-69,,24.403179,0
1451,1,1,S,2,1,3,Male,White,72,169.19901,69.400002,136,84,201,,,14.1,41,387,85,2,0,0,2,8651,18508,91.300003,22,4.9000001,1,94,121,49,11,0,0,0,,3,0,0,1,0,0,0,0,1,0,0,1,0,0,2.3978953,70+,lead<25,24.241745,0
1452,1,1,S,2,1,1,Male,White,29,171.297,70.989998,116,80,136,,,15.5,45,338,102,1,0,0,2,26725,0,93.900002,30.200001,5,1.5,112,109,44,,0,0,0,,1,1,0,0,0,0,0,0,1,0,0,1,0,0,,20-29,,24.193441,0
1453,1,1,S,1,1,8,Male,Black,25,174,87.769997,122,74,226,,,14.5,45,304,51,3,0,0,2,8221,16444,70.5,16.799999,4.5999999,1,119,141,38,27,0,1,0,,5,0,0,0,0,1,0,0,1,0,1,0,0,0,3.2958369,20-29,lead>=25,28.989958,0
1454,1,1,S,1,1,1,Female,White,70,149.09801,48.759998,110,64,219,,,11.6,36.200001,332,108,4,0,0,2,4031,0,,32.5,4.0999999,.30000001,62,92,44,,1,0,0,0,1,1,0,0,0,0,0,0,1,0,1,0,0,0,,70+,,21.934109,0
1455,1,1,S,2,1,1,Female,White,70,147.59801,62.259998,130,76,270,,,12.5,40,355,89,3,0,0,2,13802,33722,,25.1,4.5,1.5,83,134,42,14,1,0,0,0,1,1,0,0,0,0,0,0,1,0,0,1,0,0,2.6390574,70+,lead<25,28.579071,0
1456,1,1,S,1,1,2,Male,White,65,172.69901,89.809998,120,90,242,,,15.6,47.5,418,85,3,1,0,2,2881,0,91.300003,20.299999,4.4000001,1.9,98,154,41,,0,0,0,,2,0,1,0,0,0,0,0,1,0,1,0,0,0,,60-69,,30.112375,1
1457,1,1,S,1,1,2,Male,White,55,171.5,59.759998,118,82,188,,,13.2,40.5,298,129,3,0,0,2,9815,19876,96.900002,43.299999,4.5999999,.89999998,78,117,67,24,0,0,0,,2,0,1,0,0,0,0,0,1,0,1,0,0,0,3.1780539,50-59,lead<25,20.318064,0
1458,1,1,S,1,1,1,Male,White,42,192.797,79.489998,110,78,177,,,13.5,41,238,79,1,0,0,2,27889,0,92.099998,33.200001,4.6999998,.5,,89,38,,0,0,0,,1,1,0,0,0,0,0,0,1,0,1,0,0,0,,40-49,,21.385134,0
1459,1,1,S,2,1,2,Female,Black,63,169.39799,102.51,196,90,192,,,12.6,38,306,82,5,0,0,2,3628,8642,92.199997,26.799999,4.4000001,1.5,92,102,48,15,1,1,0,0,2,0,1,0,0,0,0,0,1,0,0,1,0,0,2.7080503,60-69,lead<25,35.723148,1
1460,1,1,S,2,1,2,Male,White,36,176,65.550003,104,80,213,,,16.700001,48.200001,367,86,3,0,0,2,8646,0,93.800003,23.4,5.1999998,.5,83,130,41,,0,0,0,,2,0,1,0,0,0,0,0,1,0,0,1,0,0,,30-39,,21.161545,0
1462,1,1,S,2,1,3,Female,White,48,156.39799,54.32,134,88,242,,,14.1,42,316,104,3,0,0,2,9682,0,94.199997,32.900002,4.6999998,.2,82,158,51,,1,0,0,0,3,0,0,1,0,0,0,0,1,0,0,1,0,0,,40-49,,22.207384,0
1463,1,1,S,1,1,4,Male,Other,36,171.69901,56.130001,106,66,271,,,15.6,47.5,402,95,3,0,0,2,8646,18672,93.699997,23.6,5,1.1,125,95,31,,0,0,1,,4,0,0,0,1,0,0,0,1,0,1,0,0,0,,30-39,,19.039673,0
1465,1,1,S,2,1,3,Male,White,25,167.5,74.5,140,78,176,,,15.9,46,412,106,1,0,0,2,26205,54109,87.599998,25.700001,5.3000002,.60000002,125,90,32,22,0,0,0,,3,0,0,1,0,0,0,0,1,0,0,1,0,0,3.0910425,20-29,lead<25,26.553799,1
1466,1,1,S,2,1,4,Male,White,28,185.39799,81.650002,140,98,198,,,16.700001,48,334,75,2,0,0,2,27482,0,,22.5,5.0999999,.89999998,86,142,37,,0,0,0,,4,0,0,0,1,0,0,0,1,0,0,1,0,0,,20-29,,23.754513,1
1467,1,1,S,2,1,3,Female,White,60,149.19901,62.939999,130,80,255,,,14.9,43.200001,395,82,2,0,0,2,4310,11172,96.400002,20.799999,4.9000001,1.1,97,124,53,15,1,0,0,0,3,0,0,1,0,0,0,0,1,0,0,1,0,0,2.7080503,60-69,lead<25,28.274496,0
1468,1,1,S,2,1,4,Female,White,38,160,57.720001,120,76,294,,,13.1,41,353,117,1,0,0,2,8648,0,94,33.099998,4.9000001,2.4000001,88,122,43,,1,0,0,0,4,0,0,0,1,0,0,0,1,0,0,1,0,0,,30-39,,22.546875,0
1469,1,1,S,2,1,5,Male,Black,41,180.5,113.29,140,100,176,,,15.8,49,332,68,3,0,0,2,31965,57643,94.599998,20.5,,.30000001,82,100,48,,0,1,0,,5,0,0,0,0,1,0,0,1,0,0,1,0,0,,40-49,,34.772602,1
1472,1,1,S,2,1,2,Male,White,62,172.39799,58.290001,146,88,234,,,14.1,41.700001,376,95,2,0,0,2,9159,0,88.900002,25.299999,4.9000001,1.6,85,96,47,,0,0,0,,2,0,1,0,0,0,0,0,1,0,0,1,0,0,,60-69,,19.61235,1
1473,1,1,S,2,1,2,Male,Black,64,176.39799,93.779999,226,120,177,,,14.1,45,274,55,2,0,0,2,12689,32124,88.199997,20.1,4.4000001,.40000001,70,100,37,18,0,1,0,,2,0,1,0,0,0,0,0,1,0,0,1,0,0,2.8903718,60-69,lead<25,30.13859,1
1479,1,1,S,2,1,2,Female,White,68,158.59801,78.93,186,86,186,,,13.4,39,285,65,2,0,0,2,3201,6457,,22.799999,4.5999999,.89999998,102,122,53,9,1,0,0,0,2,0,1,0,0,0,0,0,1,0,0,1,0,0,2.1972246,60-69,lead<25,31.379545,1
1481,1,1,S,2,1,1,Female,White,21,177,65.32,100,70,149,,,11.8,37,398,114,1,0,0,2,23205,51533,87.5,28.6,4.4000001,1.1,54,72,38,11,1,0,0,0,1,1,0,0,0,0,0,0,1,0,0,1,0,0,2.3978953,20-29,lead<25,20.849691,0
1482,1,1,S,2,1,3,Male,White,40,200,87.769997,126,76,182,,,14.7,44.5,379,73,3,0,0,2,29977,0,87.400002,19.299999,5.0999999,1,86,125,28,,0,0,0,,3,0,0,1,0,0,0,0,1,0,0,1,0,0,,40-49,,21.942499,0
1483,1,1,S,1,1,1,Male,Black,26,169.69901,58.290001,130,66,179,,,16.700001,53,414,180,3,0,0,2,7260,15158,100,43.5,5.3000002,.40000001,97,95,31,34,0,1,0,,1,1,0,0,0,0,0,0,1,0,1,0,0,0,3.5263605,20-29,lead>=25,20.241163,0
1484,1,1,S,1,1,8,Female,Black,52,160.69901,90.720001,170,106,292,,,14.2,43.700001,336,88,4,0,0,2,11156,0,,26.200001,4.4000001,.69999999,84,109,60,,1,1,0,0,5,0,0,0,0,1,0,0,1,0,1,0,0,0,,50-59,,35.129879,1
1485,1,1,S,2,1,2,Male,White,70,172.09801,83.580002,156,66,331,,,14.2,43,356,89,3,0,0,2,8651,18508,86.900002,25,4.4000001,1.6,81,149,44,18,0,0,0,,2,0,1,0,0,0,0,0,1,0,0,1,0,0,2.8903718,70+,lead<25,28.219589,1
1486,1,1,S,2,1,3,Male,White,57,169.39799,70.080002,114,80,197,,,14.1,43,428,105,1,0,0,2,25519,0,95.599998,24.5,5,1.8,83,172,,,0,0,0,,3,0,0,1,0,0,0,0,1,0,0,1,0,0,,50-59,,24.421795,0
1490,1,1,S,2,1,4,Male,Black,24,185.797,74.5,128,68,131,,,15.5,47.5,398,79,2,0,0,2,11052,0,85.300003,19.799999,4.8000002,.89999998,102,156,33,,0,1,0,,4,0,0,0,1,0,0,0,1,0,0,1,0,0,,20-29,,21.581364,0
1492,1,1,S,1,1,4,Female,White,72,152.69901,88,146,90,210,,,13.2,40,348,73,4,0,1,2,4031,0,86.599998,21,4.5,1.3,88,139,42,,1,0,0,0,4,0,0,0,1,0,0,0,1,0,1,0,0,0,,70+,,37.740726,1
1493,1,1,S,2,1,2,Male,Black,66,171.797,90.830002,176,100,237,,,13.4,40.700001,326,68,3,0,0,2,11351,23083,87.300003,20.9,4.9000001,.89999998,74,116,52,14,0,1,0,,2,0,1,0,0,0,0,0,1,0,0,1,0,0,2.6390574,60-69,lead<25,30.775009,1
1495,1,1,S,2,1,5,Female,White,70,158,52.5,174,96,196,,,12.7,38.700001,304,80,5,0,0,2,9611,19388,,26.299999,4.1999998,1,62,114,38,17,1,0,0,0,5,0,0,0,0,1,0,0,1,0,0,1,0,0,2.8332133,70+,lead<25,21.030283,1
1496,1,1,S,2,1,2,Male,White,71,158.69901,64.300003,170,80,196,,,14.1,42.700001,310,58,4,1,0,2,12286,0,92.199997,18.700001,4.1999998,2.5999999,105,87,36,,0,0,0,,2,0,1,0,0,0,0,0,1,0,0,1,0,0,,70+,,25.530691,1
1497,1,1,S,1,1,1,Male,White,73,167.69901,70.989998,130,58,210,,,15.6,49.700001,334,114,5,0,0,2,10773,24399,92.599998,34.099998,4.1999998,1,99,131,38,17,0,0,0,,1,1,0,0,0,0,0,0,1,0,1,0,0,0,2.8332133,70+,lead<25,25.242722,0
1499,1,1,S,1,1,2,Female,White,69,160.69901,89.93,116,80,226,,,13.5,40,424,75,2,0,1,2,4031,8609,87,17.700001,4.8000002,1.2,83,131,51,15,1,0,0,0,2,0,1,0,0,0,0,0,1,0,1,0,0,0,2.7080503,60-69,lead<25,34.823967,0
1500,1,1,S,1,1,6,Female,Black,63,156.5,82.330002,174,116,179,,,13.6,41,318,58,4,0,0,2,4138,0,76.800003,18.200001,4.5999999,1.5,90,149,48,,1,1,0,0,5,0,0,0,0,1,0,0,1,0,1,0,0,0,,60-69,,33.614716,1
1503,1,1,S,2,1,2,Male,White,72,153.59801,65.199997,134,78,264,,,14.1,43.200001,364,73,3,0,0,2,12286,31833,88.900002,20.1,4.5999999,1.2,85,149,64,19,0,0,0,,2,0,1,0,0,0,0,0,1,0,0,1,0,0,2.9444389,70+,lead<25,27.636078,0
1506,1,1,S,2,1,3,Male,Black,24,167.5,52.5,126,100,141,,,16.700001,50.200001,383,111,1,0,0,2,11052,0,93.800003,29,4.6999998,1.1,112,107,33,,0,1,0,,3,0,0,1,0,0,0,0,1,0,0,1,0,0,,20-29,,18.712408,1
1507,1,1,S,2,1,2,Male,White,49,185.59801,79.269997,110,70,138,,,13.3,42,278,81,3,0,0,2,25750,51477,89,29.1,4.8000002,.89999998,78,122,35,14,0,0,0,,2,0,1,0,0,0,0,0,1,0,0,1,0,0,2.6390574,40-49,lead<25,23.012417,0
1508,1,1,S,1,1,5,Male,White,41,187.39799,94.919998,120,80,240,,,15.4,45,362,90,1,0,0,2,9067,0,83.300003,24.9,5,1,84,110,42,,0,0,0,,5,0,0,0,0,1,0,0,1,0,1,0,0,0,,40-49,,27.028868,0
1510,1,1,S,1,1,2,Male,White,67,176.297,81.080002,146,84,200,,,15.7,45,330,80,4,0,0,2,9721,0,85.400002,24.200001,4.3000002,1.2,81,110,41,,0,0,0,,2,0,1,0,0,0,0,0,1,0,1,0,0,0,,60-69,,26.086987,1
1511,1,1,S,2,1,1,Female,White,22,162.797,80.629997,94,80,219,,,14.1,41.5,401,93,1,0,0,2,7729,17164,94.099998,23.200001,4.9000001,1.5,106,178,38,10,1,0,0,0,1,1,0,0,0,0,0,0,1,0,0,1,0,0,2.3025851,20-29,lead<25,30.423128,0
1512,1,1,S,1,1,2,Female,White,71,155.297,61.919998,140,70,208,,,14.8,43.200001,324,42,2,1,0,2,4031,0,76.900002,13,4,.80000001,76,134,49,,1,0,0,1,2,0,1,0,0,0,0,0,1,0,1,0,0,0,,70+,,25.674667,1
1513,1,1,S,2,1,2,Female,White,60,167.69901,82.779999,160,82,265,,,13.8,44.700001,396,79,2,0,0,2,9011,19286,97.199997,19.9,4.5999999,1.5,55,132,47,18,1,0,0,0,2,0,1,0,0,0,0,0,1,0,0,1,0,0,2.8903718,60-69,lead<25,29.435028,1
1514,1,1,S,2,1,6,Male,White,43,179.59801,81.989998,128,88,211,,,13.9,43,408,110,2,0,0,2,27889,0,88.300003,27,5,1.5,82,128,31,,0,0,0,,5,0,0,0,0,1,0,0,1,0,0,1,0,0,,40-49,,25.418964,0
1515,1,1,S,2,1,6,Female,White,52,157.19901,62.029999,124,78,224,,,13.2,40,358,106,1,0,0,2,29070,58545,90.300003,29.6,4.8000002,1.2,78,126,44,15,1,0,0,0,5,0,0,0,0,1,0,0,1,0,0,1,0,0,2.7080503,50-59,lead<25,25.101645,0
1517,1,1,S,2,1,4,Female,White,43,167.89799,57.950001,112,84,240,,,12.8,38,332,94,3,0,0,2,25964,53543,86.599998,28.299999,4.8000002,.5,94,214,48,17,1,0,0,0,4,0,0,0,1,0,0,0,1,0,0,1,0,0,2.8332133,40-49,lead<25,20.557127,0
1518,1,1,S,2,1,1,Male,Black,70,169.09801,75.519997,108,60,158,,,13.4,40.5,296,93,4,0,1,2,3781,0,98.099998,31.4,4.6999998,1,91,141,42,,0,1,0,,1,1,0,0,0,0,0,0,1,0,0,1,0,0,,70+,,26.411009,0
1520,1,1,S,2,1,2,Female,White,71,154.69901,64.18,136,78,293,,,14.4,42.5,312,97,3,0,0,2,4597,0,89.5,31.1,4.5999999,1.5,127,130,61,,1,0,0,0,2,0,1,0,0,0,0,0,1,0,0,1,0,0,,70+,,26.817894,0
1521,1,1,S,2,1,1,Female,White,46,161.297,70.870003,108,66,260,,,14,42,308,105,1,0,0,2,28268,58430,90.300003,34.099998,4.5,.80000001,74,107,41,15,1,0,0,0,1,1,0,0,0,0,0,0,1,0,0,1,0,0,2.7080503,40-49,lead<25,27.240175,0
1522,1,1,S,2,1,4,Female,White,48,157,89.809998,128,86,212,,,10.3,33.200001,460,37,4,0,0,2,9415,0,73.900002,8,4.3000002,1.3,66,157,212,,1,0,0,0,4,0,0,0,1,0,0,0,1,0,0,1,0,0,,40-49,,36.435555,0
1526,1,1,S,1,1,2,Female,Black,38,156.89799,69.970001,108,84,188,,,13.1,39,363,93,2,0,0,2,10986,0,98.5,25.6,4.5,2,83,100,37,,1,1,0,0,2,0,1,0,0,0,0,0,1,0,1,0,0,0,,30-39,,28.42347,0
1527,1,1,S,2,1,3,Female,Black,57,146.5,61.919998,142,86,179,,,11.1,34.200001,328,68,3,0,0,2,9375,21074,77.599998,20.700001,4,.5,55,112,43,19,1,1,0,0,3,0,0,1,0,0,0,0,1,0,0,1,0,0,2.9444389,50-59,lead<25,28.850655,1
1529,1,1,S,2,1,2,Female,White,52,149.89799,83.239998,124,76,288,,,14.2,42.700001,402,63,1,0,0,2,9415,19461,85.099998,15.7,4.8000002,1.2,86,124,46,,1,0,0,0,2,0,1,0,0,0,0,0,1,0,0,1,0,0,,50-59,,37.045921,0
1531,1,1,S,2,1,1,Female,White,54,163.5,68.040001,140,78,239,,,14.3,43,400,66,3,1,0,2,27718,54681,81.099998,16.5,4.5999999,1.7,84,158,50,14,1,0,0,1,1,1,0,0,0,0,0,0,1,0,0,1,0,0,2.6390574,50-59,lead<25,25.452404,1
1532,1,1,S,1,1,2,Male,White,73,176.89799,54.549999,124,76,234,,,17.9,52,326,100,1,0,0,2,21545,0,100.8,30.700001,4.8000002,1,111,160,46,,0,0,0,,2,0,1,0,0,0,0,0,1,0,1,0,0,0,,70+,,17.432068,0
1533,1,1,S,2,1,1,Female,Black,61,170,91.400002,154,100,140,,,14,43,386,170,3,0,1,2,7256,17284,86.199997,44,3.9000001,1.3,70,154,33,11,1,1,0,0,1,1,0,0,0,0,0,0,1,0,0,1,0,0,2.3978953,60-69,lead<25,31.626299,1
1536,1,1,S,2,1,2,Female,White,55,176.69901,137.44,134,90,178,,,14.1,43.5,344,56,1,0,0,2,9764,0,90.800003,16.299999,4.4000001,1.4,,,59,,1,0,0,0,2,0,1,0,0,0,0,0,1,0,0,1,0,0,,50-59,,44.019485,1
1540,1,1,S,2,1,2,Male,White,64,159.5,46.610001,124,76,237,,,14.5,45,360,69,2,0,0,2,3799,0,90,19.200001,4.8000002,1.1,74,130,40,,0,0,0,,2,0,1,0,0,0,0,0,1,0,0,1,0,0,,60-69,,18.321362,0
1541,1,1,S,2,1,3,Female,White,24,156.39799,52.16,96,70,156,,,13,40.5,350,82,1,0,1,2,26276,55904,99.5,23.4,4.8000002,1.5,75,94,40,11,1,0,0,0,3,0,0,1,0,0,0,0,1,0,0,1,0,0,2.3978953,20-29,lead<25,21.324322,0
1542,1,1,S,1,1,1,Female,White,71,150.59801,43.09,128,72,260,,,13,39,370,50,5,0,0,2,4031,0,91.300003,13.5,4.3000002,.40000001,69,175,52,,1,0,0,0,1,1,0,0,0,0,0,0,1,0,1,0,0,0,,70+,,18.999319,0
1544,1,1,S,2,1,4,Male,White,62,144.797,60.669998,150,104,230,,,15.2,46.700001,318,46,4,0,1,2,11405,0,93.199997,14.5,4.5,1.2,94,111,42,,0,0,0,,4,0,0,0,1,0,0,0,1,0,0,1,0,0,,60-69,,28.937092,1
1546,1,1,S,2,1,5,Male,Black,43,167.297,83.919998,190,130,147,,,15.9,47,326,94,5,0,0,2,12294,0,94.599998,28.799999,4.8000002,.69999999,94,,36,,0,1,0,,5,0,0,0,0,1,0,0,1,0,0,1,0,0,,40-49,,29.983973,1
1551,1,1,S,1,1,4,Male,White,62,179.797,84.599998,156,112,285,,,14.9,44.700001,316,77,4,0,0,2,4332,10634,86.599998,24.4,4.6999998,1.6,91,99,49,16,0,0,0,,4,0,0,0,1,0,0,0,1,0,1,0,0,0,2.7725887,60-69,lead<25,26.170107,1
1560,1,1,S,2,1,2,Female,White,56,163.797,71.099998,130,86,325,,,13.4,41.200001,378,84,2,0,0,2,26624,0,90.400002,22.200001,4.6999998,1.4,66,91,51,,1,0,0,0,2,0,1,0,0,0,0,0,1,0,0,1,0,0,,50-59,,26.500723,0
1600,1,1,S,2,1,2,Male,White,61,177,88.230003,136,100,188,106,,15.9,46.5,340,109,3,0,0,2,3017,0,,32.099998,4.5999999,1.4,97,85,47,,0,0,0,,2,0,1,0,0,0,0,0,1,0,0,1,0,0,,60-69,,28.162407,1
1602,1,1,S,2,1,1,Female,White,21,165.69901,56.470001,108,70,183,91,,14.7,43.200001,379,69,3,0,0,2,23205,0,96.900002,18.200001,4.6999998,.89999998,114,135,45,,1,0,0,0,1,1,0,0,0,0,0,0,1,0,0,1,0,0,,20-29,,20.567333,0
1603,1,1,S,2,1,1,Female,White,69,160,63.389999,100,74,214,115,,12.9,39.200001,367,92,4,0,0,2,3237,6530,94.900002,25.1,4.6999998,1.6,99,113,42,17,1,0,0,0,1,1,0,0,0,0,0,0,1,0,0,1,0,0,2.8332133,60-69,lead<25,24.761719,0
1604,1,1,S,1,1,3,Male,White,66,175.39799,79.379997,134,76,269,137,,17.5,52.5,361,131,1,0,0,2,8556,0,94.599998,36.299999,4.6999998,1.2,,,34,,0,0,0,,3,0,0,1,0,0,0,0,1,0,1,0,0,0,,60-69,,25.802502,0
1605,1,1,S,2,1,3,Male,White,26,168.19901,88.230003,116,80,196,43,,15.8,46.200001,300,109,2,0,0,2,26205,54109,77.099998,36.299999,4.6999998,.80000001,99,119,54,27,0,0,0,,3,0,0,1,0,0,0,0,1,0,0,1,0,0,3.2958369,20-29,lead>=25,31.186703,0
1606,1,1,S,1,1,2,Male,White,72,179.297,74.050003,130,96,160,74,,15.7,48.200001,334,101,1,0,0,2,2850,0,94,30.200001,4.5999999,1.2,86,100,32,,0,0,0,,2,0,1,0,0,0,0,0,1,0,1,0,0,0,,70+,,23.034513,1
1608,1,1,S,2,1,1,Female,Black,72,155.69901,66.449997,128,76,222,99,,12.4,39,267,57,1,0,0,2,3828,0,89.199997,21.299999,4.3000002,1,90,145,39,,1,1,0,0,1,1,0,0,0,0,0,0,1,0,0,1,0,0,,70+,,27.4109,0
1610,1,1,S,1,1,1,Female,White,28,172.59801,71.669998,90,70,160,47,,12.8,38.5,367,63,1,0,0,2,24953,0,100.5,17.200001,4.4000001,2.3,80,109,42,,1,0,0,0,1,1,0,0,0,0,0,0,1,0,1,0,0,0,,20-29,,24.05835,0
1611,1,1,S,2,1,4,Female,Black,64,167.39799,121,190,100,263,91,,12.5,38.700001,312,74,5,0,1,2,4138,11275,89,23.700001,4.0999999,.89999998,104,106,39,9,1,1,0,0,4,0,0,0,1,0,0,0,1,0,0,1,0,0,2.1972246,60-69,lead<25,43.180222,1
1613,1,1,S,2,1,3,Female,Black,22,164.797,64.860001,98,48,166,133,,11.8,36.200001,393,99,2,0,0,2,32111,57829,83.599998,25.200001,3.9000001,1,,212,64,14,1,1,0,0,3,0,0,1,0,0,0,0,1,0,0,1,0,0,2.6390574,20-29,lead<25,23.882421,0
1615,1,1,S,2,1,2,Male,White,64,167.89799,62.369999,124,74,209,81,,14.2,45.5,359,109,2,0,0,2,10292,18041,87.699997,30.4,4.6999998,1.6,104,124,44,11,0,0,0,,2,0,1,0,0,0,0,0,1,0,0,1,0,0,2.3978953,60-69,lead<25,22.125072,0
1618,1,1,S,1,1,7,Male,White,70,167.5,61.119999,140,68,195,131,,15.1,47,300,137,4,1,1,2,8556,0,,45.700001,4.8000002,.80000001,94,94,45,,0,0,0,,5,0,0,0,0,1,0,0,1,0,1,0,0,0,,70+,,21.784807,1
1619,1,1,S,1,1,2,Male,White,66,159,66.790001,114,74,191,114,,16,47,416,79,1,0,0,2,3588,8126,100.2,19,4.1999998,1.5,,,29,23,0,0,0,,2,0,1,0,0,0,0,0,1,0,1,0,0,0,3.1354942,60-69,lead<25,26.41905,0